{"text_format":"1","workbook":"xlsx","n_sheets":8,"sheets":["Introduction","Inputs","CHP Spark Spread Results","Energy Use and Operating Costs","Technology Assumptions","State Energy Prices","Defaults","Applications"],"not_rendered":{"charts":0,"images":4,"macros":1,"external_links":2,"defined_names":121,"comments":1,"pivot_tables":0},"unopened":[],"bounds":{"document_bytes":16777216,"sheet_cells":100000,"rows_first":2000,"rows_last":500,"rows_between":2000,"halvings":0,"cell_chars":16384,"cell_head_chars":4096},"cells_cut":0,"cells_raw":0,"read":"whole","date_system":"1900"}

{"sheet":"Introduction","index":0,"n_rows":78,"n_cols":7,"rows_kept":78,"cut":false,"hidden":false,"merged":[[16,0,16,10],[17,0,18,10],[4,0,4,3],[5,0,7,10],[9,0,11,10],[13,0,13,10],[14,0,14,10],[15,0,15,10],[19,0,21,10],[22,0,22,1],[24,0,29,10],[33,0,33,10],[34,0,34,10],[52,0,52,10],[41,0,41,10],[42,0,42,10],[43,0,43,10],[44,0,44,10],[45,0,45,10],[46,0,46,10],[47,0,47,10],[33,11,35,11],[49,0,49,3],[50,0,50,10],[51,0,51,10],[35,0,35,10],[36,0,36,10],[37,0,37,10],[38,0,38,10],[39,0,39,10],[40,0,40,10],[69,0,69,10],[54,0,59,10],[62,0,62,2],[63,0,63,10],[53,0,53,10],[64,0,64,10],[65,0,65,10],[66,0,66,10],[67,0,67,10],[68,0,68,10],[75,0,75,5],[77,0,79,10],[71,0,71,5],[71,6,71,9],[72,0,73,10]]}
[]
[]
["Spark Spread Estimator Version 1.2"]
[]
["INTRODUCTION AND PURPOSE"]
["The Combined Heat and Power Partnership (CHPP) Spark Spread Estimator is a tool that evaluates the anticipated spark spread of a CHP system compared to using separate heat and power (SHP).  "]
[]
[]
[]
["Spark spread is the difference per kilowatt-hour (kWh) between the current delivered electricity price and the total cost to generate power with a CHP system. A numerically positive spark spread result indicates that the CHP project returns more than the cost of capital. The greater the  spark spread, the higher the potential return on investment."]
[]
[]
[]
["The estimator is intended to help CHP end users and other interested parties conduct a very preliminary initial screening of potential CHP cost savings at a facility based on basic site data – annual electricity usage, annual thermal loads, average electricity and fuel prices, and annual hours of operation. The tool is not intended to estimate the economic performance of a specific CHP project.  It is intended only to give the user an initial understanding of whether CHP has the potential to provide economic savings at their facility.  In addition to comparing a preliminary estimate of the cost to generate power on-site (including a CHP thermal credit) in terms of $/kWh to the retail price of power at the site (the “spark spread), the estimator provides an approximate comparison of energy consumption and costs with and without CHP in order to provide context for the estimated spark spread."]
[]
["An important functional issue for the estimator is the use of macros to perform calculations and move the user through the estimator. Macros must be enabled in Excel for the estimator to function properly.  "]
[]
["Instructions and notes accompany each field in the estimator. In addition, there is a separate documentation file linked from each worksheet in the estimator that provides further information, references, descriptions, and assumptions. "]
[]
["The estimator is designed for users with at least a moderate understanding of CHP technology and its terminology. If you would like to learn more about CHP technologies, please visit: "]
[]
[]
["www.epa.gov/chp"]
[]
["Please note that the results generated by the estimator are intended for educational and outreach purposes only; it is not designed for use in feasibility studies or to make investment-grade decisions. All results achieved through the independent use of the estimator are subject to input error and therefore are not endorsed by the EPA CHP Partnership. If you are interested in additional technical assistance to evaluate whether CHP is applicable to your facility, please contact the CHP Partnership help line at 703-373-8108 or chp@epa.gov."]
[]
[]
[]
[]
[]
{"$rows_left_out":49}
{"sheet":"Inputs","index":1,"n_rows":31,"n_cols":5,"rows_kept":31,"cut":false,"hidden":false,"merged":[[30,4,32,4],[13,1,14,1],[0,5,6,5],[10,5,10,6],[27,4,28,4],[9,4,11,4],[13,4,14,4]]}
[null,"Spark Spread Estimator Version 1.2"]
[]
[null,null,null,null,"Instructions"]
[null,"1.  What state is the facility located in?",null,null,"Click on the input cell and use the drop down list to select the appropriate state. "]
[]
[null,"2.  What is the line of business of the facility?",null,null,"Click on the input cell and use the drop down list to select the appropriate line of business (categories are based on two- or four-digit SIC codes). If your facility's line of business is not listed, select a similar line of business."]
[]
[null,"3.  What is the typical monthly electric use in kWh?",null,null,"Enter the kWh used during a typical month or divide the annual kWh consumption by 12. "]
[]
[null,"4.  What is the typical monthly heating load or fuel use of the facility (enter a value in only ONE of the boxes)?",null,null,"Enter a value in either the monthly heating load or monthly fuel use input box. If possible, enter the heating load, which will produce a better estimate of spark spread.\n\nIf inputting monthly fuel use, input total gas use from a representative month's natural gas bill, or calculate from annual gas consumption divided by 12. If this information is not available, select the “use default” option, which will estimate the heating load based on the line of business selected in question 2.                             \n1 Therm is equivalent to 0.1 MMBtu (1 MMBtu = 10 Therms)         \n1 MCF is equivalent to 1.03 MMBtu (1 MMBtu = 0.97 MCF)\n\nThe estimator considers heating loads only (CHP can provide cooling as well, and if this is your primary thermal need, please contact the CHPP helpline at 703-373-8108 for additional assistance).         "]
[null,"Monthly heating load in MMBtu"]
[null,"Monthly Fuel Use in MMBtu"]
[]
[null,"5.  How many hours per year does the facility \n     operate?",3,null,"Enter the annual operating hours of the facility or choose from one of the hourly operating schedules in the drop-down list. If the annual operating hours of the facility are not known, use the default button that will estimate the operating hours based on the line of business selected in question 2."]
[]
[]
[null,"6.  Would the facility be able to use the CHP Investment Tax Credit?",null,null,"CHP systems placed into service before January 1, 2017 may be eligible for a 10 percent federal investment tax credit. In order to take advantage of this tax credit, the system owner must have tax liability to which the credit can be applied. Select yes or no in this input to indicate whether the facility can use this Investment Tax Credit."]
[]
[null,"7.  What is the existing fuel price in $/MMBtu?",null,null,"Enter the cost of fuel currently used to produce thermal energy at the facility. If unsure of the fuel cost, the default button will supply the average industrial natural gas price for the state."]
[null,null,null,null,"1 Therm is equivalent to 0.1 MMBtu (1 MMBtu = 10 Therms)                                                                                                                                                                       1 MCF is equivalent to 1.03 MMBtu (1 MMBtu = 0.97 MCF)"]
[]
[null,"8.  What is the CHP fuel price in $/MMBtu?",null,null,"In many cases the CHP fuel price will be the same as the existing fuel price entered in question 7. However in certain states, fuel for CHP systems is provided at a special rate. If your state or utility offers a discounted CHP fuel price, enter it in this subsection, otherwise enter the same fuel price used in question 7."]
[]
[null,"9.  What is the existing all-in electric price in $/kWh?",null,null,"Enter the total price of electricity at the facility in $/kWh. To calculate this value, take the total bill amount for a representative month and divide by the number of kWh consumed. If this value is not known, select the default button to use the industrial average  retail electric price for the state."]
[]
[null,"10.  What is the existing thermal equipment \n      efficiency? (typically 75 - 82%)",null,null,"Input the efficiency of the equipment currently providing thermal energy to the facility. This can be boilers producing steam or hot water, or direct process heaters, for example. The efficiency of thermal equipment is typically between 75 and 82 percent. If this value is not known, select the default button to use the default value of 80 percent."]
[]
[null,"11. What is the cost of capital for your company?",null,null,"Input the cost of capital used by your organization to evaluate capital investments. The cost of capital is the cost of a company's funds (both debt and equity). Typically, it is the minimum return that the company expects for a capital project, thus setting a benchmark that a new project has to meet. The default value of 7 percent is a typical cost of capital for commercial companies."]
[]
[]
{"$rows_left_out":2}
{"sheet":"CHP Spark Spread Results","index":2,"n_rows":40,"n_cols":5,"rows_kept":40,"cut":false,"hidden":false,"merged":[[35,4,35,5],[36,4,36,5],[31,4,31,5],[33,4,33,5],[20,3,20,5],[29,4,29,5],[30,4,30,5],[5,0,5,5],[6,0,6,4],[39,1,42,3],[10,3,10,5],[11,3,11,5],[32,4,32,5],[34,4,34,5],[15,3,15,5],[16,3,16,5],[17,3,17,5],[18,3,18,5],[19,3,19,5],[37,4,37,5],[21,3,21,5],[22,3,22,5],[28,4,28,5]]}
["CHP Spark Spread Results"]
["Spark Spread Estimator Version 1.2"]
[]
[]
[]
["The results generated by this estimator are intended for educational and outreach purposes only; "]
["they are not intended to replace the economic calculations in a Level 1 CHP feasibility analysis."]
[]
["Facility Energy Use*"]
[]
[null,"Facility Average Electric Demand, kW",{"$f":"IF(OpHours=0,0,ElecUse/OpHours*12)","v":0},"The facility electric demand based on the monthly electric use and hours of operation specified on the Inputs page"]
[null,"Facility Average Heating, MMBtu/hour",{"$f":"IF(OpHours=0,0,IF(ThermalUse=0,FuelUse*0.8/OpHours*12,ThermalUse/OpHours*12))","v":0},"The facility hourly heating load based on the heating load or fuel use and hours of operation specified on the Inputs page"]
[]
["CHP System Information*"]
[]
[null,"CHP System Type",{"$f":"CHPSysTypeDef","v":"No CHP"},"The CHP system type identified by the estimator to best meet the energy needs of the facility (based on size of heating load)"]
[null,"CHP System Capacity, kW",{"$f":"MIN(HLOOKUP(BaseThermalUse,'Technology Assumptions'!$C$3:$I$4,2)*BaseThermalUse*1000000/3413,BaseElecDemand)","v":0},"The CHP system size identified by the estimator to best meet the energy needs of the facility. In the absence of a load profile that shows the facility’s electric demand over time, the estimator assumes that the facility’s electric demand is constant. The CHP system is sized to meet this constant electric demand"]
[null,"CHP Electric Efficiency",{"$f":"ElecEffDef","v":"No CHP"},"The electric efficiency of the specified CHP system"]
[null,"CHP Thermal Output, Btu/kWh",{"$f":"CHPThermOutputDef","v":"No CHP"},"The thermal output of the CHP system on a Btu/kWh basis"]
[null,"CHP Thermal Output, MMBtu/hour",{"$f":"IF(CHPSize<50,\"No CHP\",C19*CHPSize/1000000)","v":"No CHP"},"The thermal output of the CHP system on an MMBtu/hr basis"]
[null,"CHP System Fuel Cost (Natural Gas), $/MMBtu",{"$f":"CHPFuelPrice","v":0},"The price of fuel for the CHP system"]
[null,"CHP Installed Cost, $/kW",{"$f":"TotalCapCostDef","v":"No CHP"},"The installed cost of the CHP system in $/kW"]
[null,"CHP O&M Cost, cents/kWh",{"$f":"OandMCostsDef","v":"No CHP"},"The non-fuel operating and maintenance cost of the CHP system in $/kWh"]
[]
[]
["CHP Cost to Generate Power *"]
[]
[null,"Operating Cost to Generate"]
[null,"  CHP Fuel Costs, $/kWh",null,{"$f":"IF(CHPSysTypeDef=\"No CHP\",\"No CHP\",'Energy Use and Operating Costs'!D24*CHPFuelPrice/'Energy Use and Operating Costs'!D16)","v":"No CHP"},"The cost of fuel consumed by the CHP system, per kWh"]
[null,"  Thermal Credit, $/kWh",null,{"$f":"IF(CHPSysTypeDef=\"No CHP\",\"No CHP\",-('Energy Use and Operating Costs'!C23-'Energy Use and Operating Costs'!D23)*BoilerFuelPrice/'Energy Use and Operating Costs'!D16)","v":"No CHP"},"The fuel cost avoided by having CHP provide thermal energy to the site, per kWh"]
{"$rows_left_out":11}
{"sheet":"Energy Use and Operating Costs","index":3,"n_rows":44,"n_cols":5,"rows_kept":44,"cut":false,"hidden":false,"merged":[[5,0,5,5],[6,0,6,4],[40,1,42,3],[8,0,9,4],[43,1,45,3]]}
["Energy Use and Operating Costs "]
["Spark Spread Estimator Version 1.2"]
[]
[]
[]
["The results generated by this estimator are intended for educational and outreach purposes only; "]
["they are not intended to replace the economic calculations in a Level 1 CHP feasibility analysis."]
[]
["The estimate of annual energy use and operating costs presented in this worksheet are supplemental to the CHP Spark Spread Results. They are included here to provide context for the estimated spark spread."]
[]
[]
["Estimate of Annual Energy Use and Operating Costs"]
[null,"Energy Use","No CHP","With CHP","Difference"]
[null,"Annual Electricity Use"]
[null,"  Annual Purchased Power, kWh",{"$f":"ElecUse*12","v":0},{"$f":"IF(CHPSysTypeDef=\"No CHP\",\"No CHP\",IF(C15-D16<0,0,C15-D16))","v":"No CHP"},{"$f":"IF(CHPSysTypeDef=\"No CHP\",\"No CHP\",D15-C15)","v":"No CHP"}]
[null,"  Annual CHP Power Generation, kWh",0,{"$f":"IF(CHPSysTypeDef=\"No CHP\",\"No CHP\",CHPSize*CHPAvailabilityDef*OpHours)","v":"No CHP"},{"$f":"IF(CHPSysTypeDef=\"No CHP\",\"No CHP\",D16-C16)","v":"No CHP"}]
[null,"Total Annual Electricity Use, kWh",{"$f":"SUM(C15:C16)","v":0},{"$f":"SUM(D15:D16)","v":0},{"$f":"IF(CHPSysTypeDef=\"No CHP\",\"No CHP\",D17-C17)","v":"No CHP"}]
[null,"Annual Thermal Energy Use"]
[null,"  Non-CHP Thermal Use*, MMBtu/yr",{"$f":"BaseThermalUse*OpHours","v":0},{"$f":"IF(CHPSysTypeDef=\"No CHP\",\"No CHP\",IF(D20>C19,0,C19-D20))","v":"No CHP"},{"$f":"IF(CHPSysTypeDef=\"No CHP\",\"No CHP\",D19-C19)","v":"No CHP"}]
[null,"  CHP Thermal Used, MMBtu/yr",0,{"$f":"IF(CHPSysTypeDef=\"No CHP\",\"No CHP\",IF(CHPThermOutputDef*CHPThermUtilDefault*D16/1000000>C19,C19,CHPThermOutputDef*CHPThermUtilDefault*D16/1000000))","v":"No CHP"},{"$f":"IF(CHPSysTypeDef=\"No CHP\",\"No CHP\",D20-C20)","v":"No CHP"}]
[null," Total Thermal Energy Use, MMBtu/yr",{"$f":"C19","v":0},{"$f":"IF(CHPSysTypeDef=\"No CHP\",\"No CHP\",D19+D20)","v":"No CHP"},{"$f":"IF(CHPSysTypeDef=\"No CHP\",\"No CHP\",D21-C21)","v":"No CHP"}]
[null,"Annual Fuel Use"]
[null,"  Non-CHP Thermal Fuel Use*, MMBtu/yr",{"$f":"C19/SiteBoilerEff","v":{"$error":"#DIV/0!"}},{"$f":"IF(CHPSysTypeDef=\"No CHP\",\"No CHP\",D19/SiteBoilerEff)","v":"No CHP"},{"$f":"IF(CHPSysTypeDef=\"No CHP\",\"No CHP\",D23-C23)","v":"No CHP"}]
[null,"  CHP Fuel Use, MMBtu/yr",0,{"$f":"IF(CHPSysTypeDef=\"No CHP\",\"No CHP\",D16*CHPHeatRateDef/1000000)","v":"No CHP"},{"$f":"IF(CHPSysTypeDef=\"No CHP\",\"No CHP\",D24-C24)","v":"No CHP"}]
[null," Annual Total Fuel Use, MMBtu",{"$f":"C23","v":{"$error":"#DIV/0!"}},{"$f":"IF(CHPSysTypeDef=\"No CHP\",\"No CHP\",D23+D24)","v":"No CHP"},{"$f":"IF(CHPSysTypeDef=\"No CHP\",\"No CHP\",D25-C25)","v":"No CHP"}]
[]
[null,"Operating Costs"]
[null,"Purchased Electricity",{"$f":"C15*AvgElecPrice","v":0},{"$f":"IF(CHPSysTypeDef=\"No CHP\",\"No CHP\",C28*(1-ElecAvoidedDefault)+D15*AvgElecPrice*ElecAvoidedDefault)","v":"No CHP"},{"$f":"IF(CHPSysTypeDef=\"No CHP\",\"No CHP\",D28-C28)","v":"No CHP"}]
[null,"Purchased Fuel",{"$f":"C25*BoilerFuelPrice","v":{"$error":"#DIV/0!"}},{"$f":"IF(CHPSysTypeDef=\"No CHP\",\"No CHP\",D25*CHPFuelPrice)","v":"No CHP"},{"$f":"IF(CHPSysTypeDef=\"No CHP\",\"No CHP\",D29-C29)","v":"No CHP"}]
[null,"Incremental O&M",0,{"$f":"IF(CHPSysTypeDef=\"No CHP\",\"No CHP\",OandMCostsDef*D16)","v":"No CHP"},{"$f":"IF(CHPSysTypeDef=\"No CHP\",\"No CHP\",D30-C30)","v":"No CHP"}]
{"$rows_left_out":15}
{"sheet":"Technology Assumptions","index":4,"n_rows":20,"n_cols":9,"rows_kept":20,"cut":false,"hidden":true,"merged":[]}
[null,"System","No CHP"," 100 kW Rich Burn RE  Integral 3 way catalyst","  800kW Lean Burn w SCR","3000 kW RE","5 MW   GT","10 MW GT","40 MW GT"]
[null,"Electric Capacity, kW",0,50,500,2000,4000,10000,20000]
[null,"Thermal, Btu/hour",0,{"$f":"D2*D15/1000000","v":0.30499999999999999},{"$f":"E2*E15/1000000","v":2.1495000000000002},{"$f":"3000*F15/1000000","v":10.53},{"$f":"3000*G15/1000000","v":15},{"$f":"H2*H15/1000000","v":46.74},{"$f":"I2*I15/1000000","v":63.78}]
[null,"Power to Heat Ratio",0.56000000000000005,{"$f":"3413/D15","v":0.55950819672131147},0.79390555943242613,0.97236467236467239,0.68259999999999998,0.73020967051775776,1.070241455001568]
[null,"Market Size Bin","No CHP","50-500 kW","500kW-2,000kW","2-4 MW","4-10 MW","10-20 MW",">20 MW"]
[null,"Technology","No CHP","Recip Engine","Recip Engine","Recip Engine","Gas Turbine","Gas Turbine","Gas Turbine"]
[null,"Capacity, kW","No CHP",50,500,2000,4000,10000,20000]
[null,"Basic Capital Costs","No CHP",2210,1640,1500,1400,1298,972]
[null,"Early Market/Site Adders","No CHP",1.2,1.2,1.1000000000000001,1.05,1.05,1.05]
[null,"Adjusted Capital Cost","No CHP",2750,2000,1550,2000,1600,1230]
[null,"AT Cost, $/kW","No CHP",0,300,200,240,180,80]
[null,"Total Capital Cost, $/kW","No CHP",{"$f":"SUM(D10:D11)","v":2750},2300,1750,2240,1780,1310]
[null,"Federal ITC","No CHP",{"$f":"D12*0.1","v":275},230,175,224,178,131]
[null,"Heat Rate, Btu/kWh","No CHP",12000,9760,9492,12000,11765,9220]
[null,"Thermal Output, Btu/kWh","No CHP",{"$f":"610000/100","v":6100},4299,{"$f":"10530000/3000","v":3510},5000,4674,3189]
[null,"Electric Efficiency, %","No CHP",{"$f":"3412/D14","v":0.28433333333333333},0.34959016393442621,0.35946059839865152,0.28433333333333333,0.29001274968125795,0.3700650759219089]
[null,"O&M Costs, $/kWh","No CHP",0.02,1.6E-2,1.4E-2,0.01,8.9999999999999993E-3,6.0000000000000001E-3]
[null,"Economic Life, years","No CHP",10,10,15,20,20,20]
[null,"Availability","No CHP",0.95,0.95,0.95,0.95,0.95,0.95]
[null,"Power to Heat Ratio","No CHP",{"$f":"3413/D15","v":0.55950819672131147},0.79390555943242613,0.97236467236467239,0.68259999999999998,0.73020967051775776,1.070241455001568]

{"sheet":"State Energy Prices","index":5,"n_rows":55,"n_cols":4,"rows_kept":55,"cut":false,"hidden":true,"merged":[]}
[null,"Average Industrial Electric and Gas Prices "]
[]
[null,"Average Industrial Price by State"]
[null,"State","Electric Price $ / kWh","Gas Price, $/MMBtu"]
[null,"Alabama",6.1792307692307702E-2,6.096289999999998]
[null,"Alaska",0.158,7.3492299999999986]
[null,"Arizona",6.7207692307692302E-2,6.3459300000000001]
[null,"Arkansas",5.9215384615384614E-2,7.5909699999999996]
[null,"California",0.11693846153846152,5.9940209090909082]
[null,"Colorado",7.3915384615384605E-2,6.678861788617886]
[null,"Connecticut",0.12843076923076924,6.7906999999999993]
[null,"Delaware",8.7538461538461551E-2,7.1097941666666662]
[null,"District of Columbia",7.6299999999999993E-2,7.0812850880758802]
[null,"Florida",7.9507692307692307E-2,6.1934599999999991]
[null,"Georgia",6.4669230769230757E-2,5.9774859287054412]
[null,"Hawaii",0.30415384615384616,26.296435272045034]
[null,"Idaho",6.1907692307692309E-2,5.5113309090909084]
[null,"Illinois",6.1876923076923065E-2,6.3824136363636361]
[null,"Indiana",6.7892307692307682E-2,6.4644299999999992]
[null,"Iowa",5.8638461538461535E-2,7.2992445454545454]
[null,"Kansas",7.324615384615385E-2,5.9924953095684801]
[null,"Kentucky",5.7192307692307681E-2,5.5737335834896813]
[null,"Louisiana",6.0499999999999991E-2,4.4855534709193252]
[null,"Maine",8.8853846153846144E-2,8.9501211111111107]
[null,"Maryland",9.0207692307692308E-2,7.8449549999999997]
[null,"Massachusetts",0.12807692307692306,8.4849627272727268]
[null,"Michigan",7.6776923076923076E-2,6.2804916666666664]
[null,"Minnesota",7.1138461538461539E-2,5.9902439024390253]
[null,"Mississippi",6.7138461538461536E-2,5.9609756097560984]
[null,"Missouri",6.1776923076923076E-2,7.6059799999999997]
{"$rows_left_out":26}
{"sheet":"Defaults","index":6,"n_rows":93,"n_cols":6,"rows_kept":93,"cut":false,"hidden":true,"merged":[]}
[]
[]
[]
[null,"Monthly Fuel Use in MMBtu/month?",{"$f":"ElecUse/VLOOKUP(Application,Applications!$B$2:$E$40,2,FALSE)*3413/1000000/0.8","v":{"$error":"#N/A"}}]
[null,"Annual Facility Operating Hours",{"$f":"VLOOKUP(Application,Applications!$B$2:$E$40,4,FALSE)","v":{"$error":"#N/A"}}]
[null,"Federal ITC",{"$f":"IF(FederalITC=\"Yes\",10%,\"\")","v":""}]
[null,"Boiler Fuel Price, $/MMBtu",{"$f":"VLOOKUP(State,'State Energy Prices'!$B$5:$D$55,3,FALSE)","v":{"$error":"#N/A"}}]
[null,"CHP Fuel Price, $/MMBtu",{"$f":"VLOOKUP(State,'State Energy Prices'!$B$5:$D$55,3,FALSE)","v":{"$error":"#N/A"}}]
[null,"Average Electric Price, $/kWh",{"$f":"VLOOKUP(State,'State Energy Prices'!$B$5:$D$55,2,FALSE)","v":{"$error":"#N/A"}}]
[null,"Percent of Average Electric Rate Avoided",0.9]
[null,"Site Boiler Efficiency",0.8]
[null,"CHP Thermal Utilization",1]
[null,"Cost of Capital, %",7.0000000000000007E-2]
[null,"Inflation Rate %",0.02]
[]
[null,"CHP System Type",{"$f":"HLOOKUP(CHPSize,'Technology Assumptions'!$C$2:$I$20,D16)","v":"No CHP"},5]
[null,"Total Capital Cost, $/kW",{"$f":"HLOOKUP(CHPSize,'Technology Assumptions'!$C$2:$I$20,D17)","v":"No CHP"},11]
[null,"Federal ITC, $/kW",{"$f":"IF(C6=\"\",0,TotalCapCostDef*C6*-1)","v":0},12]
[null,"Heat Rate, Btu/kWh",{"$f":"HLOOKUP(CHPSize,'Technology Assumptions'!$C$2:$I$20,D19)","v":"No CHP"},13]
[null,"Thermal Output, Btu/kWh",{"$f":"HLOOKUP(CHPSize,'Technology Assumptions'!$C$2:$I$20,D20)","v":"No CHP"},14]
[null,"Electric Efficiency, %",{"$f":"HLOOKUP(CHPSize,'Technology Assumptions'!$C$2:$I$20,D21)","v":"No CHP"},15]
[null,"O&M Costs, $/kWh",{"$f":"HLOOKUP(CHPSize,'Technology Assumptions'!$C$2:$I$20,D22)","v":"No CHP"},16]
[null,"Economic Life, years",{"$f":"HLOOKUP(CHPSize,'Technology Assumptions'!$C$2:$I$20,D23)","v":"No CHP"},17]
[null,"CHP Plant Availability",{"$f":"HLOOKUP(CHPSize,'Technology Assumptions'!$C$2:$I$20,D24)","v":"No CHP"},18]
[null,"Power to heat Ratio",{"$f":"HLOOKUP(CHPSize,'Technology Assumptions'!$C$2:$I$20,D25)","v":"No CHP"},19]
[]
[null,"Federal ITC Value",{"$f":"IF(CHPSize>15000,FedITCDef*15000,FedITCDef*CHPSize)","v":0}]
[null,"Yes"]
[null,"No"]
[]
{"$rows_left_out":64}
{"sheet":"Applications","index":7,"n_rows":40,"n_cols":5,"rows_kept":40,"cut":false,"hidden":true,"merged":[]}
[null,"Industry Description","P/H Ratio","Thermal App.","Load, hours / year"]
[null,"20 - Food and Kindred Products",0.54700000000000004,"Heat",7500]
[null,"21 - Tobacco Products",1.85,"Heat",7500]
[null,"22 - Textiles",1.054,"Heat",7500]
[null,"24 - Lumber and Wood",0.48799999999999999,"Heat",7500]
[null,"25 - Furniture",4.4370000000000003,"Heat",7500]
[null,"26 - Paper",0.29299999999999998,"Heat",8760]
[null,"27 - Printing",11.164999999999999,"Heat",7500]
[null,"28 - Chemicals",0.65900000000000003,"Heat",8760]
[null,"29 - Petroleum Refining",0.26100000000000001,"Heat",8760]
[null,"30 - Rubber/Misc Plastics",3.0790000000000002,"Heat",8760]
[null,"32 - Stone/Clay/Glass",8.7260000000000009,"Heat",8760]
[null,"33 - Primary Metals",4.6900000000000004,"Heat",8760]
[null,"34 - Fabricated Metals",5.0259999999999998,"Heat",7500]
[null,"35 - Machinery/Computer Equip",6.8460000000000001,"Heat",7500]
[null,"37 - Trasportation Equip.",73.498999999999995,"Heat",7500]
[null,"38 - Instruments",7.8419999999999996,"Heat",7500]
[null,"39 - Misc. Manufacturing",10.318,"Heat",7500]
[null,"4222 - Warehouses",0.68,"Cool",8760]
[null,"4300 - Post Offices",1.2592592592592593,"Cool",4500]
[null,"4581 - Airports",1.0967741935483872,"Cool",8760]
[null,"4952 - Water Treatment/Sanitary",1.36,"Heat",7500]
[null,"5200 - Big Box Retail",1.8378378378378379,"Cool",4500]
[null,"5411 - Food Sales",3.4,"Cool",8760]
[null,"5812 - Restaurants",1.4166666666666667,"Cool",4500]
[null,"6512 - Office Buildings ",1.0967741935483872,"Cool",4500]
[null,"6513 - Apartments",0.80952380952380965,"Heat/Cool",7500]
[null,"7011 - Hotels",0.80952380952380965,"Heat/Cool",7500]
[null,"7211 - Laundries",0.68,"Heat",4500]
[null,"7542 - Carwashes",0.68,"Heat",4500]
{"$rows_left_out":10}